Target
Coagulation factor XI
Ligand
BDBM50448600
Substrate
Meas. Tech.
ChEMBL_1296332 (CHEMBL3129742)
Ki
37±n/a nM
Citation
 Quan, MLWong, PCWang, CWoerner, FSmallheer, JMBarbera, FABozarth, JMBrown, RLHarpel, MRLuettgen, JMMorin, PEPeterson, TRamamurthy, VRendina, ARRossi, KAWatson, CAWei, AZhang, GSeiffert, DWexler, RR Tetrahydroquinoline derivatives as potent and selective factor XIa inhibitors. J Med Chem 57:955-69 (2014)  
Target
Name:
Coagulation factor XI
Synonyms:
Coagulation factor XIa Coagulation factor XIa light chain FA11_HUMAN Factor XIa PTA | Plasma thromboplastin antecedent
Type:
Enzyme
Mol. Mass.:
70130.58
Organism:
Homo sapiens (Human)
Description:
P03951
Residue:
625
  
Inhibitor
Name:
BDBM50448600
Synonyms:
CHEMBL3124966
Type:
Small organic molecule
Emp. Form.:
C31H30N4O4S
Mol. Mass.:
554.659
SMILES:
C[C@@]1(C[C@H](Nc2ccc(cc12)C(N)=N)c1cccc(c1)-c1ccc(NS(C)(=O)=O)cc1C(O)=O)c1ccccc1
: