Target
11-beta-hydroxysteroid dehydrogenase 1
Ligand
BDBM50448693
Substrate
Meas. Tech.
ChEMBL_1297897 (CHEMBL3132110)
IC50
0.400000±n/a nM
Citation
 Goldberg, FWDossetter, AGScott, JSRobb, GRBoyd, SGroombridge, SDKemmitt, PDSjögren, TGutierrez, PMdeSchoolmeester, JSwales, JGTurnbull, AVWild, MJ Optimization of brain penetrant 11ß-hydroxysteroid dehydrogenase type I inhibitors and in vivo testing in diet-induced obese mice. J Med Chem 57:970-86 (2014)  
Target
Name:
11-beta-hydroxysteroid dehydrogenase 1
Synonyms:
11-DH 11-beta-Hydroxysteroid Dehydrogenase 1 (11-beta-HSD1) 11-beta-hydroxysteroid dehydrogenase 1 (11HSD1) Corticosteroid 11-beta-dehydrogenase isozyme 1 (11-beta-HSD-1) Corticosteroid 11-beta-dehydrogenase isozyme 1 (11beta-HSD1) HSD11 HSD11L | SDR26C1
Type:
Enzyme
Mol. Mass.:
32409.16
Organism:
Homo sapiens (Human)
Description:
P28845
Residue:
292
  
Inhibitor
Name:
BDBM50448693
Synonyms:
CHEMBL3127857
Type:
Small organic molecule
Emp. Form.:
C23H29N3O4S
Mol. Mass.:
443.559
SMILES:
OC12CC3CC(C1)C(NC(=O)c1sc(OC4CC(C4)C#N)nc1[C@H]1CCCO1)C(C3)C2
: