Target
Tyrosine-protein kinase JAK2
Ligand
BDBM50448785
Substrate
Meas. Tech.
ChEMBL_1294431 (CHEMBL3129257)
IC50
12±n/a nM
Citation
 Huang, QJohnson, TWBailey, SBrooun, ABunker, KDBurke, BJCollins, MRCook, ASCui, JJDack, KNDeal, JGDeng, YLDinh, DEngstrom, LDHe, MHoffman, JHoffman, RLJohnson, PSKania, RSLam, HLam, JLLe, PTLi, QLingardo, LLiu, WLu, MWMcTigue, MPalmer, CLRichardson, PFSach, NWShen, HSmeal, TSmith, GLStewart, AETimofeevski, STsaparikos, KWang, HZhu, HZhu, JZou, HYEdwards, MP Design of potent and selective inhibitors to overcome clinical anaplastic lymphoma kinase mutations resistant to crizotinib. J Med Chem 57:1170-87 (2014)  
Target
Name:
Tyrosine-protein kinase JAK2
Synonyms:
JAK-2 JAK2_HUMAN Janus kinase 2 (JAK2) | Janus kinase 2 (a protein tyrosine kinase)
Type:
Protein
Mol. Mass.:
130684.68
Organism:
Homo sapiens (Human)
Description:
O60674
Residue:
1132
  
Inhibitor
Name:
BDBM50448785
Synonyms:
CHEMBL3128069
Type:
Small organic molecule
Emp. Form.:
C22H23FN6O3S
Mol. Mass.:
470.52
SMILES:
C[C@@H](Oc1cc(cnc1N)-c1sc(nc1C)[C@](C)(O)CO)c1cc(F)ccc1-n1nccn1
: