Target
Aldehyde dehydrogenase, dimeric NADP-preferring
Ligand
BDBM22794
Substrate
Meas. Tech.
ChEMBL_1295310 (CHEMBL3128577)
Ki
1200±n/a nM
Citation
 Kimble-Hill, ACParajuli, BChen, CHMochly-Rosen, DHurley, TD Development of selective inhibitors for aldehyde dehydrogenases based on substituted indole-2,3-diones. J Med Chem 57:714-22 (2014)  
Target
Name:
Aldehyde dehydrogenase, dimeric NADP-preferring
Synonyms:
AL3A1_HUMAN ALDH3A1 Aldehyde dehydrogenase family 3 member A1 (ALDH3A1) | Aldehyde dehydrogenase family 3 member A1 (ALDH3A1) (Q122A)
Type:
Protein
Mol. Mass.:
50394.38
Organism:
Homo sapiens (Human)
Description:
Residue:
453
  
Inhibitor
Name:
BDBM22794
Synonyms:
1-benzyl-2,3-dihydro-1H-indole-2,3-dione | Isatin-based compound, 14
Type:
Small organic molecule
Emp. Form.:
C15H11NO2
Mol. Mass.:
237.2533
SMILES:
O=C1N(Cc2ccccc2)c2ccccc2C1=O
: