Target
Aldehyde dehydrogenase, mitochondrial
Ligand
BDBM50448802
Substrate
Meas. Tech.
ChEMBL_1295317 (CHEMBL3130565)
IC50
50±n/a nM
Citation
 Kimble-Hill, ACParajuli, BChen, CHMochly-Rosen, DHurley, TD Development of selective inhibitors for aldehyde dehydrogenases based on substituted indole-2,3-diones. J Med Chem 57:714-22 (2014)  
Target
Name:
Aldehyde dehydrogenase, mitochondrial
Synonyms:
ALDH class 2 ALDH2 ALDHI Aldehyde dehydrogenase (ALDH2)
Type:
Enzyme
Mol. Mass.:
56382.67
Organism:
Homo sapiens (Human)
Description:
P05091
Residue:
517
  
Inhibitor
Name:
BDBM50448802
Synonyms:
CHEMBL3128207
Type:
Small organic molecule
Emp. Form.:
C16H12BrNO2
Mol. Mass.:
330.176
SMILES:
Brc1ccc2N(CCc3ccccc3)C(=O)C(=O)c2c1
: