Target
Solute carrier family 22 member 2
Ligand
BDBM50420192
Substrate
Meas. Tech.
ChEMBL_836779 (CHEMBL2075304)
IC50
15000±n/a nM
Citation
 Goralski, KBLou, GProwse, MTGorboulev, VVolk, CKoepsell, HSitar, DS The cation transporters rOCT1 and rOCT2 interact with bicarbonate but play only a minor role for amantadine uptake into rat renal proximal tubules. J Pharmacol Exp Ther 303:959-68 (2002)  
Target
Name:
Solute carrier family 22 member 2
Synonyms:
Adrenaline alpha2 Organic cation transporter 2 Slc22a2 rOCT2
Type:
Enzyme Catalytic Domain
Mol. Mass.:
62348.38
Organism:
RAT
Description:
Adrenaline alpha2 0 RAT::Q9R0W2
Residue:
555
  
Inhibitor
Name:
BDBM50420192
Synonyms:
CHEMBL2074851
Type:
Small organic molecule
Emp. Form.:
C24H26N3
Mol. Mass.:
356.4828
SMILES:
CC[n+]1c(CC2C=C(C)N=C(N2C)c2ccccc2)ccc2ccccc12
: