Target
Solute carrier family 22 member 1
Ligand
BDBM50420192
Substrate
Meas. Tech.
ChEMBL_836966 (CHEMBL2075806)
IC50
89000±n/a nM
Citation
 Goralski, KBLou, GProwse, MTGorboulev, VVolk, CKoepsell, HSitar, DS The cation transporters rOCT1 and rOCT2 interact with bicarbonate but play only a minor role for amantadine uptake into rat renal proximal tubules. J Pharmacol Exp Ther 303:959-68 (2002)  
Target
Name:
Solute carrier family 22 member 1
Synonyms:
Adrenaline alpha1 Organic cation transporter 1 Slc22a1 adrenergic Alpha1 | rOCT1
Type:
Enzyme Catalytic Domain
Mol. Mass.:
61538.40
Organism:
RAT
Description:
Adrenaline alpha1 0 RAT::Q63089
Residue:
556
  
Inhibitor
Name:
BDBM50420192
Synonyms:
CHEMBL2074851
Type:
Small organic molecule
Emp. Form.:
C24H26N3
Mol. Mass.:
356.4828
SMILES:
CC[n+]1c(CC2C=C(C)N=C(N2C)c2ccccc2)ccc2ccccc12
: