Target
Carbonic anhydrase 1
Ligand
BDBM13076
Substrate
Meas. Tech.
ChEMBL_956004 (CHEMBL2380061)
Ki
328±n/a nM
Citation
 Vullo, DLuca, VDScozzafava, ACarginale, VRossi, MSupuran, CTCapasso, C The alpha-carbonic anhydrase from the thermophilic bacterium Sulfurihydrogenibium yellowstonense YO3AOP1 is highly susceptible to inhibition by sulfonamides. Bioorg Med Chem 21:1534-8 (2013)  
Target
Name:
Carbonic anhydrase 1
Synonyms:
CA-I CAB Carbonate dehydratase I Carbonic anhydrase 1 (CA I) Carbonic anhydrase 1 (Recombinant CA I) Carbonic anhydrase B Carbonic anhydrase I (CA I) Carbonic anhydrase I (CAI) Carbonic anhydrase isoenzyme I (hCA I) | hCA
Type:
Enzyme
Mol. Mass.:
28873.37
Organism:
Homo sapiens (Human)
Description:
P00915
Residue:
261
  
Inhibitor
Name:
BDBM13076
Synonyms:
6-chloro-1,1-dioxo-3,4-dihydro-2H-1,2,4-benzothiadiazine-7-sulfonamide Dichlothiazide Hydrochlorothiazide JFD00715 cid_3639
Type:
Small organic molecule
Emp. Form.:
C7H8ClN3O4S2
Mol. Mass.:
297.739
SMILES:
NS(=O)(=O)c1cc2c(NCNS2(=O)=O)cc1Cl
: