Target
Acetylcholinesterase
Ligand
BDBM50005171
Substrate
Meas. Tech.
ChEMBL_1278106 (CHEMBL3095604)
IC50
270±n/a nM
Citation
 Komloova, MHorova, AHrabinova, MJun, DDolezal, MVinsova, JKuca, KMusilek, K Preparation, in vitro evaluation and molecular modelling of pyridinium-quinolinium/isoquinolinium non-symmetrical bisquaternary cholinesterase inhibitors. Bioorg Med Chem Lett 23:6663-6 (2013)  
Target
Name:
Acetylcholinesterase
Synonyms:
ACES_HUMAN Acetylcholinesterase (AChE) | Acetylcholinesterase (human AChE)
Type:
Enzyme
Mol. Mass.:
67792.70
Organism:
Homo sapiens (Human)
Description:
P22303
Residue:
614
  
Inhibitor
Name:
BDBM50005171
Synonyms:
CHEMBL3093800
Type:
Small organic molecule
Emp. Form.:
C22H28Br2N2
Mol. Mass.:
480.279
SMILES:
[Br-].[Br-].C(CCCC[n+]1cccc2ccccc12)CCC[n+]1ccccc1
: