Target
Amiloride-sensitive amine oxidase [copper-containing]
Ligand
BDBM45440
Substrate
Meas. Tech.
ChEMBL_1337635 (CHEMBL3242684)
Ki
290±n/a nM
Citation
 Huang, TLMayence, AVanden Eynde, JJ Some non-conventional biomolecular targets for diamidines. A short survey. Bioorg Med Chem 22:1983-92 (2014)  
Target
Name:
Amiloride-sensitive amine oxidase [copper-containing]
Synonyms:
ABP AOC1 Amiloride-binding protein DAO1 Diamine oxidase (DAO) KAO | Kidney amine oxidase
Type:
Protein
Mol. Mass.:
85387.64
Organism:
Homo sapiens (Human)
Description:
P19801
Residue:
751
  
Inhibitor
Name:
BDBM45440
Synonyms:
4-[5-(4-amidinophenoxy)pentoxy]benzamidine;2-hydroxyethanesulfonic acid 4-[5-(4-carbamimidoylphenoxy)pentoxy]benzenecarboximidamide;2-oxidanylethanesulfonic acid MLS000028738 PENTAMIDINE ISETHIONATE cid_359323
Type:
Small organic molecule
Emp. Form.:
C19H24N4O2
Mol. Mass.:
340.4195
SMILES:
NC(=N)c1ccc(OCCCCCOc2ccc(cc2)C(N)=N)cc1
: