Target
Bifunctional epoxide hydrolase 2
Ligand
BDBM50001940
Substrate
Meas. Tech.
ChEMBL_1338955 (CHEMBL3240515)
IC50
127000±n/a nM
Citation
 Amano, YYamaguchi, TTanabe, E Structural insights into binding of inhibitors to soluble epoxide hydrolase gained by fragment screening and X-ray crystallography. Bioorg Med Chem 22:2427-34 (2014)  
Target
Name:
Bifunctional epoxide hydrolase 2
Synonyms:
Cytosolic epoxide hydrolase 2 EPHX2 HYES_HUMAN Soluble epoxide hydrolase (sEH) | epoxide hydrolase 2, cytoplasmic
Type:
Enzyme
Mol. Mass.:
62613.07
Organism:
Homo sapiens (Human)
Description:
P34913
Residue:
555
  
Inhibitor
Name:
BDBM50001940
Synonyms:
CHEMBL3233605
Type:
Small organic molecule
Emp. Form.:
C11H10N4
Mol. Mass.:
198.2239
SMILES:
Cn1cc(cn1)-c1nc2ccccc2[nH]1
: