Target
Cholinesterase
Ligand
BDBM50022775
Substrate
Meas. Tech.
ChEMBL_1339870 (CHEMBL3243659)
IC50
49600±n/a nM
Citation
 Aslam, SZaib, SAhmad, MGardiner, JMAhmad, AHameed, AFurtmann, NGütschow, MBajorath, JIqbal, J Novel structural hybrids of pyrazolobenzothiazines with benzimidazoles as cholinesterase inhibitors. Eur J Med Chem 78:106-17 (2014)  
Target
Name:
Cholinesterase
Synonyms:
BCHE CHLE_HORSE | Cholinesterase
Type:
Enzyme
Mol. Mass.:
65643.35
Organism:
Equus caballus (Horse)
Description:
P81908
Residue:
574
  
Inhibitor
Name:
BDBM50022775
Synonyms:
(m-Hydroxyphenyl)trimethylammonium dimethylcarbamate 3-[(dimethylcarbamoyl)oxy]-N,N,N-trimethylanilinium CHEMBL278020 Eustigmine Neostigmine (2) Vagostigmine | m-Trimethylammoniumphenyldimethylcarbamate
Type:
Small organic molecule
Emp. Form.:
C12H19N2O2
Mol. Mass.:
223.2909
SMILES:
CN(C)C(=O)Oc1cccc(c1)[N+](C)(C)C
: