Target
cGMP-specific 3',5'-cyclic phosphodiesterase
Ligand
BDBM50005032
Substrate
Meas. Tech.
ChEMBL_1338674 (CHEMBL3242012)
Kd
1500±n/a nM
Citation
 Ren, JHe, YChen, WChen, TWang, GWang, ZXu, ZLuo, XZhu, WJiang, HShen, JXu, Y Thermodynamic and structural characterization of halogen bonding in protein-ligand interactions: a case study of PDE5 and its inhibitors. J Med Chem 57:3588-93 (2014)  
Target
Name:
cGMP-specific 3',5'-cyclic phosphodiesterase
Synonyms:
3',5'-cyclic phosphodiesterase PDE5 PDE5A_HUMAN Phosphodiesterase 5 (PDE5) Phosphodiesterase 5A (PDE5A) cGMP-specific 3',5'-cyclic phosphodiesterase
Type:
Protein
Mol. Mass.:
99975.83
Organism:
Homo sapiens (Human)
Description:
O76074
Residue:
875
  
Inhibitor
Name:
BDBM50005032
Synonyms:
CHEMBL1915516
Type:
Small organic molecule
Emp. Form.:
C20H28N4O4S
Mol. Mass.:
420.526
SMILES:
CCCOc1ccc(cc1-c1nc(CC)cc(=O)[nH]1)S(=O)(=O)N1CCN(C)CC1
: