Target
Histone-arginine methyltransferase CARM1
Ligand
BDBM50210461
Substrate
Meas. Tech.
ChEMBL_1334937 (CHEMBL3239253)
IC50
400000±n/a nM
Citation
 Yan, LYan, CQian, KSu, HKofsky-Wofford, SALee, WCZhao, XHo, MCIvanov, IZheng, YG Diamidine compounds for selective inhibition of protein arginine methyltransferase 1. J Med Chem 57:2611-22 (2014)  
Target
Name:
Histone-arginine methyltransferase CARM1
Synonyms:
CARM1 Coactivator-associated arginine methyltransferase 1 PRMT4 Protein arginine methyltransferase 4 (PRMT4)
Type:
Protein
Mol. Mass.:
65855.47
Organism:
Homo sapiens (Human)
Description:
Q86X55
Residue:
608
  
Inhibitor
Name:
BDBM50210461
Synonyms:
(stilbamidine)4-[2-[4-amino(imino)methylphenyl]-(E)-1-ethenyl]phenyl-iminomethanamine 4-((E)-2-{4-[(Z)-amino(imino)methyl]phenyl}vinyl)benzenecarboximidamide CHEMBL142304 stilbamidine
Type:
Small organic molecule
Emp. Form.:
C16H16N4
Mol. Mass.:
264.325
SMILES:
NC(=N)c1ccc(\C=C\c2ccc(cc2)C(N)=N)cc1
: