Target
Ubiquitin carboxyl-terminal hydrolase 7
Ligand
BDBM50007788
Substrate
Meas. Tech.
ChEMBL_1335825 (CHEMBL3239934)
IC50
>100000±n/a nM
Citation
 Báez-Santos, YMBarraza, SJWilson, MWAgius, MPMielech, AMDavis, NMBaker, SCLarsen, SDMesecar, AD X-ray structural and biological evaluation of a series of potent and highly selective inhibitors of human coronavirus papain-like proteases. J Med Chem 57:2393-412 (2014)  
Target
Name:
Ubiquitin carboxyl-terminal hydrolase 7
Synonyms:
Deubiquitinating enzyme 7 Herpesvirus-associated ubiquitin-specific protease USP7 Ubiquitin-specific-processing protease 7
Type:
PROTEIN
Mol. Mass.:
128274.45
Organism:
Homo sapiens (Human)
Description:
ChEMBL_1469483
Residue:
1102
  
Inhibitor
Name:
BDBM50007788
Synonyms:
CHEMBL3233809 | med.21724, Compound 167
Type:
Small organic molecule
Emp. Form.:
C27H31N3O2
Mol. Mass.:
429.5539
SMILES:
C[C@@H](N1CCC(CC1)C(=O)NCc1cccc(NC(C)=O)c1)c1cccc2ccccc12
: