Target
Ubiquitin carboxyl-terminal hydrolase 8
Ligand
BDBM50007791
Substrate
Meas. Tech.
ChEMBL_1335826 (CHEMBL3239935)
IC50
>100000±n/a nM
Citation
 Báez-Santos, YMBarraza, SJWilson, MWAgius, MPMielech, AMDavis, NMBaker, SCLarsen, SDMesecar, AD X-ray structural and biological evaluation of a series of potent and highly selective inhibitors of human coronavirus papain-like proteases. J Med Chem 57:2393-412 (2014)  
Target
Name:
Ubiquitin carboxyl-terminal hydrolase 8
Synonyms:
Deubiquitinating enzyme 8 UBP8_HUMAN USP8 Ubiquitin thioesterase 8 hUBPy
Type:
PROTEIN
Mol. Mass.:
127547.92
Organism:
Homo sapiens (Human)
Description:
ChEMBL_105200
Residue:
1118
  
Inhibitor
Name:
BDBM50007791
Synonyms:
CHEMBL3233815 | med.21724, Compound 168
Type:
Small organic molecule
Emp. Form.:
C25H27FN2O
Mol. Mass.:
390.4931
SMILES:
C[C@@H](N1CCC(CC1)C(=O)NCc1cccc(F)c1)c1cccc2ccccc12
: