Target
Cholinesterase
Ligand
BDBM50007804
Substrate
Meas. Tech.
ChEMBL_1335843 (CHEMBL3238627)
IC50
510±n/a nM
Citation
 Viayna, ESola, IBartolini, MDe Simone, ATapia-Rojas, CSerrano, FGSabaté, RJuárez-Jiménez, JPérez, BLuque, FJAndrisano, VClos, MVInestrosa, NCMuñoz-Torrero, D Synthesis and multitarget biological profiling of a novel family of rhein derivatives as disease-modifying anti-Alzheimer agents. J Med Chem 57:2549-67 (2014)  
Target
Name:
Cholinesterase
Synonyms:
Acylcholine acylhydrolase Butyrylcholine esterase (BChE) Butyrylcholinesterase (BuChE) CHLE_HUMAN Cholinesterases Pseudocholinesterase
Type:
Homotetramer
Mol. Mass.:
68422.27
Organism:
Homo sapiens (Human)
Description:
P06276
Residue:
602
  
Inhibitor
Name:
BDBM50007804
Synonyms:
CHEMBL3234040
Type:
Small organic molecule
Emp. Form.:
C40H33Cl2N3O5
Mol. Mass.:
706.613
SMILES:
Cl.CC1=CC2CC(C1)c1c(C2)nc2cc(Cl)ccc2c1NCc1ccc(CNC(=O)c2cc(O)c3C(=O)c4c(O)cccc4C(=O)c3c2)cc1
: