Target
Beta-secretase 1
Ligand
BDBM50007803
Substrate
Meas. Tech.
ChEMBL_1335844 (CHEMBL3238628)
IC50
1200±n/a nM
Citation
 Viayna, ESola, IBartolini, MDe Simone, ATapia-Rojas, CSerrano, FGSabaté, RJuárez-Jiménez, JPérez, BLuque, FJAndrisano, VClos, MVInestrosa, NCMuñoz-Torrero, D Synthesis and multitarget biological profiling of a novel family of rhein derivatives as disease-modifying anti-Alzheimer agents. J Med Chem 57:2549-67 (2014)  
Target
Name:
Beta-secretase 1
Synonyms:
ASP2 Aspartyl protease 2 BACE1 Beta-secretase (BACE) Beta-secretase 1 (BACE 1) Beta-secretase 1 (BACE1) Beta-site amyloid precursor protein cleaving enzyme 1 Memapsin-2 beta-Secretase (BACE-1) | beta-Secretase (BACE1)
Type:
Protein
Mol. Mass.:
55755.10
Organism:
Homo sapiens (Human)
Description:
P56817
Residue:
501
  
Inhibitor
Name:
BDBM50007803
Synonyms:
CHEMBL3234039
Type:
Small organic molecule
Emp. Form.:
C43H47Cl2N3O5
Mol. Mass.:
756.756
SMILES:
Cl.CC1=CC2CC(C1)c1c(C2)nc2cc(Cl)ccc2c1NCCCCCCCCCCCNC(=O)c1cc(O)c2C(=O)c3c(O)cccc3C(=O)c2c1
: