Target
Squalene synthase
Ligand
BDBM50007812
Substrate
Meas. Tech.
ChEMBL_1336736 (CHEMBL3240996)
IC50
16400±n/a nM
Citation
 Matralis, ANKourounakis, AP Design of novel potent antihyperlipidemic agents with antioxidant/anti-inflammatory properties: exploiting phenothiazine's strong antioxidant activity. J Med Chem 57:2568-81 (2014)  
Target
Name:
Squalene synthase
Synonyms:
FDFT_RAT Farnesyl-diphosphate farnesyltransferase SQS Squalene synthetase
Type:
PROTEIN
Mol. Mass.:
48109.41
Organism:
Rattus norvegicus
Description:
ChEMBL_1336736
Residue:
416
  
Inhibitor
Name:
BDBM50007812
Synonyms:
CHEMBL3234110
Type:
Small organic molecule
Emp. Form.:
C22H24N2O3S
Mol. Mass.:
396.503
SMILES:
CC(=O)N1c2ccccc2Sc2ccc(cc12)C1(O)CN2CCCCC2CO1
: