Target
GTP:AMP phosphotransferase AK3, mitochondrial
Ligand
BDBM50010315
Substrate
Meas. Tech.
ChEMBL_1340551 (CHEMBL3254975)
Ki
320000±n/a nM
Citation
 Hampton, APicker, D Design of species- or isozyme-specific enzyme inhibitors. 3. Species and isozymic differences between mammalian and bacterial adenylate kinases in substituent tolerance in an enzyme-substrate complex. J Med Chem 22:1529-32 (1980)  
Target
Name:
GTP:AMP phosphotransferase AK3, mitochondrial
Synonyms:
AK 3 Adenylate kinase 3 alpha like 1 Ak3 Akl3l KAD3_RAT
Type:
PROTEIN
Mol. Mass.:
25443.58
Organism:
Rattus norvegicus
Description:
ChEMBL_1340551
Residue:
227
  
Inhibitor
Name:
BDBM50010315
Synonyms:
CHEMBL3251363
Type:
Small organic molecule
Emp. Form.:
C16H20N5O13P3S
Mol. Mass.:
615.342
SMILES:
Nc1ncnc2n([C@@H]3O[C@H](COP(O)(=O)OP(O)(=O)OP(O)(O)=O)[C@@H](O)[C@H]3O)c(Sc3ccccc3)nc12
: