Target
Angiotensin-converting enzyme
Ligand
BDBM50010477
Substrate
Meas. Tech.
ChEMBL_1353477 (CHEMBL3269460)
Ki
11±n/a nM
Citation
 Kramer, GJMohd, ASchwager, SLMasuyer, GAcharya, KRSturrock, EDBachmann, BO Interkingdom pharmacology of Angiotensin-I converting enzyme inhibitor phosphonates produced by actinomycetes. ACS Med Chem Lett 5:346-51 (2014)  
Target
Name:
Angiotensin-converting enzyme
Synonyms:
ACE Angiotensin converting enzyme (ACE) Angiotensin-converting enzyme, soluble form CD_antigen=CD143 DCP1 Kininase II
Type:
Enzyme
Mol. Mass.:
149709.01
Organism:
Homo sapiens (Human)
Description:
Residue:
1306
  
Inhibitor
Name:
BDBM50010477
Synonyms:
CHEMBL1233799
Type:
Small organic molecule
Emp. Form.:
C25H34N3O8P
Mol. Mass.:
535.5265
SMILES:
CC[C@H](C)[C@H](NC(C)=O)C(=O)N[C@@H](Cc1ccc(O)cc1)C(=O)N[C@@H](Cc1ccc(O)cc1)P(O)(O)=O
: