Target
Adenosine receptor A2a
Ligand
BDBM50242873
Substrate
Meas. Tech.
ChEMBL_1352083 (CHEMBL3267348)
Ki
2.0±n/a nM
Citation
 de Lera Ruiz, MLim, YHZheng, J Adenosine A2A receptor as a drug discovery target. J Med Chem 57:3623-50 (2014)  
Target
Name:
Adenosine receptor A2a
Synonyms:
A2A adenosine receptor (hA2A) ADENOSINE A2 ADORA2 Adenosine A2A receptor (A2AAR)
Type:
G Protein-Coupled Receptor (GPCR)
Mol. Mass.:
44716.46
Organism:
Homo sapiens (Human)
Description:
P29274
Residue:
412
  
Inhibitor
Name:
BDBM50242873
Synonyms:
2-Furan-2-yl-7-[2-(3-methyl-7,8-dihydro-5H-[1,6]naphthyridin-6-yl)-ethyl]-7H-pyrazolo[4,3-e][1,2,4]triazolo[1,5-c]pyrimidin-5-ylamine | CHEMBL513364
Type:
Small organic molecule
Emp. Form.:
C21H21N9O
Mol. Mass.:
415.4511
SMILES:
Cc1cnc2CCN(CCn3ncc4c3nc(N)n3nc(nc43)-c3ccco3)Cc2c1
: