Target
Adenosine receptor A1
Ligand
BDBM50202986
Substrate
Meas. Tech.
ChEMBL_1352084 (CHEMBL3267349)
Ki
>996±n/a nM
Citation
 de Lera Ruiz, MLim, YHZheng, J Adenosine A2A receptor as a drug discovery target. J Med Chem 57:3623-50 (2014)  
Target
Name:
Adenosine receptor A1
Synonyms:
A1 adenosine receptor (hA1) AA1R_HUMAN ADORA1 Adenosine A1-receptor Adenosine receptor A1 (hA1) | Adenosine transporter (AdT)
Type:
G Protein-Coupled Receptor (GPCR)
Mol. Mass.:
36520.92
Organism:
Homo sapiens (Human)
Description:
P30542
Residue:
326
  
Inhibitor
Name:
BDBM50202986
Synonyms:
2-furan-2-yl-7-(2-{4-[4-(2-methoxy-ethoxy)-phenyl]-piperazin-1-yl}-ethyl)-2,7-dihydro-3H-pyrazolo[4,3-e][1,2,4]triazolo[1,5-c]pyrimidin-5-ylamine 7-(2-(4-(2,4-difluorophenyl)piperazin-1-yl)ethyl)-2-(furan-2-yl)-7H-pyrazolo[4,3-e][1,2,4]triazolo[1,5-c]pyrimidin-5-amine SCH-420814 US11472811, Example Preladenant | preladenant
Type:
Small organic molecule
Emp. Form.:
C25H29N9O3
Mol. Mass.:
503.5563
SMILES:
COCCOc1ccc(cc1)N1CCN(CCn2ncc3c2nc(N)n2nc(nc32)-c2ccco2)CC1
: