Target
Adenosine receptor A2a
Ligand
BDBM50364063
Substrate
Meas. Tech.
ChEMBL_1352071 (CHEMBL3267336)
Ki
0.500000±n/a nM
Citation
 de Lera Ruiz, MLim, YHZheng, J Adenosine A2A receptor as a drug discovery target. J Med Chem 57:3623-50 (2014)  
Target
Name:
Adenosine receptor A2a
Synonyms:
A2A adenosine receptor (hA2A) ADENOSINE A2 ADORA2 Adenosine A2A receptor (A2AAR)
Type:
G Protein-Coupled Receptor (GPCR)
Mol. Mass.:
44716.46
Organism:
Homo sapiens (Human)
Description:
P29274
Residue:
412
  
Inhibitor
Name:
BDBM50364063
Synonyms:
CHEMBL1950649
Type:
Small organic molecule
Emp. Form.:
C23H30N6O6
Mol. Mass.:
486.5209
SMILES:
CCNC(=O)[C@H]1O[C@H]([C@H](O)[C@@H]1O)n1cnc2c(N)nc(nc12)C#CC[C@H]1CC[C@@H](CC1)C(=O)OC
: