Target
Polyunsaturated fatty acid lipoxygenase ALOX15B
Ligand
BDBM50011736
Substrate
Meas. Tech.
ChEMBL_1352304 (CHEMBL3269368)
IC50
>50000±n/a nM
Citation
 Rai, GJoshi, NJung, JELiu, YSchultz, LYasgar, APerry, SDiaz, GZhang, QKenyon, VJadhav, ASimeonov, ALo, EHvan Leyen, KMaloney, DJHolman, TR Potent and selective inhibitors of human reticulocyte 12/15-lipoxygenase as anti-stroke therapies. J Med Chem 57:4035-48 (2014)  
Target
Name:
Polyunsaturated fatty acid lipoxygenase ALOX15B
Synonyms:
15-LOX-2 15-Lipoxygenase-2 (15-LOX-2) ALOX15B Arachidonate 15-lipoxygenase, type II Epithelial 15-lipoxygenase-2 | LX15B_HUMAN
Type:
Protein
Mol. Mass.:
75850.40
Organism:
Homo sapiens (Human)
Description:
Residue:
676
  
Inhibitor
Name:
BDBM50011736
Synonyms:
CHEMBL3262909
Type:
Small organic molecule
Emp. Form.:
C11H7Cl2N3O
Mol. Mass.:
268.099
SMILES:
CNc1oc(nc1C#N)-c1ccc(Cl)c(Cl)c1
: