Target
Beta-secretase 1
Ligand
BDBM50012627
Substrate
Meas. Tech.
ChEMBL_1351637 (CHEMBL3269324)
IC50
20±n/a nM
Citation
 Oehlrich, DProkopcova, HGijsen, HJ The evolution of amidine-based brain penetrant BACE1 inhibitors. Bioorg Med Chem Lett 24:2033-45 (2014)  
Target
Name:
Beta-secretase 1
Synonyms:
ASP2 Aspartyl protease 2 BACE1 Beta-secretase (BACE) Beta-secretase 1 (BACE 1) Beta-secretase 1 (BACE1) Beta-site amyloid precursor protein cleaving enzyme 1 Memapsin-2 beta-Secretase (BACE-1) | beta-Secretase (BACE1)
Type:
Protein
Mol. Mass.:
55755.10
Organism:
Homo sapiens (Human)
Description:
P56817
Residue:
501
  
Inhibitor
Name:
BDBM50012627
Synonyms:
CHEMBL3260842
Type:
Small organic molecule
Emp. Form.:
C24H20F3N5O
Mol. Mass.:
451.4437
SMILES:
COc1cccc(-c2cccc(c2)[C@]2(N=C(N)N3CC(F)(F)CN=C23)c2ccncc2)c1F
: