Target
5-hydroxytryptamine receptor 3A
Ligand
BDBM50014553
Substrate
Meas. Tech.
ChEMBL_1350968 (CHEMBL3268497)
Ki
0.800000±n/a nM
Citation
 Manning, DDGuo, CZhang, ZRyan, KNNaginskaya, JChoo, SHMasih, LEarley, WGWierschke, JDNewman, ASBrady, CABarnes, NMGuzzo, PR The discovery of diazepinone-based 5-HT3 receptor partial agonists. Bioorg Med Chem Lett 24:2578-81 (2014)  
Target
Name:
5-hydroxytryptamine receptor 3A
Synonyms:
5-HT-3 5-HT3A 5-hydroxytryptamine receptor 3 (5-HT3) 5-hydroxytryptamine receptor 3A (5HT3A) 5HT3R HTR3A Serotonin 3 receptor (5HT3) Serotonin-gated ion channel receptor | Serotonin-gated ion channel receptor 3
Type:
Protein
Mol. Mass.:
55283.27
Organism:
Homo sapiens (Human)
Description:
P46098
Residue:
478
  
Inhibitor
Name:
BDBM50014553
Synonyms:
CHEMBL3261484
Type:
Small organic molecule
Emp. Form.:
C18H22N4O
Mol. Mass.:
310.3935
SMILES:
Cc1cc2C(=O)N(CCn3ncc(c1)c23)[C@@H]1CN2CCC1CC2
: