Target
Mu-type opioid receptor
Ligand
BDBM50354578
Substrate
Meas. Tech.
ChEMBL_1348090 (CHEMBL3269119)
Ki
0.130000±n/a nM
Citation
 Kumar, VRidzwan, IEGrivas, KLewis, JWClark, MJMeurice, CJimenez-Gomez, CPogozheva, IMosberg, HTraynor, JRHusbands, SM Selectively promiscuous opioid ligands: discovery of high affinity/low efficacy opioid ligands with substantial nociceptin opioid peptide receptor affinity. J Med Chem 57:4049-57 (2014)  
Target
Name:
Mu-type opioid receptor
Synonyms:
MOR-1 Mu-type opioid receptor (MOR) OPRM_RAT Opioid receptor B Ror-b
Type:
G Protein-Coupled Receptor (GPCR)
Mol. Mass.:
44503.11
Organism:
Rattus norvegicus (rat)
Description:
Competition binding assays were carried out using membrane preparations from transfected HN9.10 cells that constitutively expressed the mu opioid receptor.
Residue:
398
  
Inhibitor
Name:
BDBM50354578
Synonyms:
BUPRENORPHINE US11534436, Compound buprenorphine | US9315514, Buprenorphine
Type:
Small organic molecule
Emp. Form.:
C29H41NO4
Mol. Mass.:
467.6401
SMILES:
CO[C@@]12CC[C@@]3(C[C@@H]1[C@](C)(O)C(C)(C)C)[C@H]1Cc4ccc(O)c5O[C@@H]2[C@]3(CCN1CC1CC1)c45
: