Target
Proteasome subunit beta type-7
Ligand
BDBM50015236
Substrate
Meas. Tech.
ChEMBL_1349633 (CHEMBL3266057)
IC50
340±n/a nM
Citation
 Zhang, JCao, JXu, LZhou, YLiu, TLi, JHu, Y Design, synthesis and biological evaluation of novel tripeptidyl epoxyketone derivatives constructed fromß-amino acid as proteasome inhibitors. Bioorg Med Chem 22:2955-65 (2014)  
Target
Name:
Proteasome subunit beta type-7
Synonyms:
Macropain chain Z PSB7_HUMAN Proteasome subunit Z | Z
Type:
PROTEIN
Mol. Mass.:
29968.13
Organism:
Homo sapiens (Human)
Description:
ChEMBL_106197
Residue:
277
  
Inhibitor
Name:
BDBM50015236
Synonyms:
CHEMBL3262752
Type:
Small organic molecule
Emp. Form.:
C33H38N4O5
Mol. Mass.:
570.6786
SMILES:
CC(C)C[C@H](NC(=O)[C@H](Cc1ccccc1)NC(=O)CC(NC(=O)c1cccnc1)c1ccccc1)C(=O)[C@@]1(C)CO1
: