Target
Aryl hydrocarbon receptor
Ligand
BDBM50015302
Substrate
Meas. Tech.
ChEMBL_1349952 (CHEMBL3269633)
EC50
1400±n/a nM
Citation
 Basham, KJBhonde, VRKieffer, CMack, JBHess, MWelm, BELooper, RE Bis-aryloxadiazoles as effective activators of the aryl hydrocarbon receptor. Bioorg Med Chem Lett 24:2473-6 (2014)  
Target
Name:
Aryl hydrocarbon receptor
Synonyms:
AHR_MOUSE Ahr | Aryl hydrocarbon receptor
Type:
Protein
Mol. Mass.:
95014.92
Organism:
Mus musculus (Mouse)
Description:
P30561
Residue:
848
  
Inhibitor
Name:
BDBM50015302
Synonyms:
CHEMBL3263112
Type:
Small organic molecule
Emp. Form.:
C14H10ClN3O
Mol. Mass.:
271.702
SMILES:
Nc1cc(Cl)ccc1-c1nc(no1)-c1ccccc1
: