Target
Aryl hydrocarbon receptor
Ligand
BDBM50015305
Substrate
Meas. Tech.
ChEMBL_1349952 (CHEMBL3269633)
EC50
>10000±n/a nM
Citation
 Basham, KJBhonde, VRKieffer, CMack, JBHess, MWelm, BELooper, RE Bis-aryloxadiazoles as effective activators of the aryl hydrocarbon receptor. Bioorg Med Chem Lett 24:2473-6 (2014)  
Target
Name:
Aryl hydrocarbon receptor
Synonyms:
AHR_MOUSE Ahr | Aryl hydrocarbon receptor
Type:
Protein
Mol. Mass.:
95014.92
Organism:
Mus musculus (Mouse)
Description:
P30561
Residue:
848
  
Inhibitor
Name:
BDBM50015305
Synonyms:
CHEMBL3263120
Type:
Small organic molecule
Emp. Form.:
C14H7Cl3N2O
Mol. Mass.:
325.577
SMILES:
Clc1ccc(-c2nc(no2)-c2ccccc2)c(Cl)c1Cl
: