Target
Acetylcholinesterase
Ligand
BDBM92962
Substrate
Meas. Tech.
ChEMBL_1360666 (CHEMBL3282824)
pH
7±n/a
Ki
6700000±n/a nM
Comments
extracted
Citation
 Alspach, JDIngraham, LL Inhibition of acetylcholinesterase by thiamine. A structure-function study. J Med Chem 20:161-4 (1977)  
Target
Name:
Acetylcholinesterase
Synonyms:
ACES_ELEEL Acetylcholinesterase (EeAChE) | ache
Type:
Enzyme
Mol. Mass.:
71812.79
Organism:
Electrophorus electricus (Electric eel)
Description:
Residue:
633
  
Inhibitor
Name:
BDBM92962
Synonyms:
ThDP
Type:
Small molecule
Emp. Form.:
C12H19N4O7P2S
Mol. Mass.:
425.314
SMILES:
Cc1c(CCOP(O)(=O)OP(O)(O)=O)sc[n+]1Cc1cnc(C)nc1N
: