Target
Acrosin
Ligand
BDBM50018975
Substrate
Meas. Tech.
ChEMBL_1365286 (CHEMBL3292380)
IC50
9300±n/a nM
Citation
 Zhao, JTian, WQi, JLv, DLiu, YJiang, YDong, GChen, QZhou, YZhu, JWang, HSheng, CLv, J Design and synthesis of phenylisoxazole derivatives as novel human acrosin inhibitors. Bioorg Med Chem Lett 24:2802-6 (2014)  
Target
Name:
Acrosin
Synonyms:
ACR ACRS
Type:
PROTEIN
Mol. Mass.:
45865.48
Organism:
Homo sapiens (Human)
Description:
ChEMBL_1365286
Residue:
421
  
Inhibitor
Name:
BDBM50018975
Synonyms:
CHEMBL3287447
Type:
Small organic molecule
Emp. Form.:
C20H20ClN5O4
Mol. Mass.:
429.857
SMILES:
Cl.CCOC(=O)c1ccc(NC(=O)c2cc(on2)-c2ccc(NC(N)=N)cc2)cc1
: