Target
Growth hormone secretagogue receptor type 1
Ligand
BDBM50019923
Substrate
Meas. Tech.
ChEMBL_1361892 (CHEMBL3293067)
Ki
69±n/a nM
Citation
 Bhattacharya, SKAndrews, KBeveridge, RCameron, KOChen, CDunn, MFernando, DGao, HHepworth, DJackson, VMKhot, VKong, JKosa, RELapham, KLoria, PMLondregan, ATMcClure, KFOrr, STPatel, JRose, CSaenz, JStock, IAStorer, GVanVolkenburg, MVrieze, DWang, GXiao, JZhang, Y Discovery of PF-5190457, a Potent, Selective, and Orally Bioavailable Ghrelin Receptor Inverse Agonist Clinical Candidate. ACS Med Chem Lett 5:474-9 (2014)  
Target
Name:
Growth hormone secretagogue receptor type 1
Synonyms:
GH-releasing peptide receptor GHS-R GHSR_HUMAN Ghrelin receptor | Ghrelin receptor 1a (GHS-R1a)
Type:
Receptor
Mol. Mass.:
41334.57
Organism:
Homo sapiens (Human)
Description:
Receptor binding studies use plasma membranes from LLC PK-1 cells transiently transfected with hGHSR1a.
Residue:
366
  
Inhibitor
Name:
BDBM50019923
Synonyms:
CHEMBL3287215
Type:
Small organic molecule
Emp. Form.:
C28H31N5O2
Mol. Mass.:
469.578
SMILES:
COc1ccc(CC(=O)N2CCC3(CN(C3)[C@@H]3CCc4cc(ccc34)-c3ccncn3)CC2)nc1
: