Target
Integrase
Ligand
BDBM50020259
Substrate
Meas. Tech.
ChEMBL_1364989 (CHEMBL3295659)
IC50
18±n/a nM
Citation
 Zhao, XZSmith, SJMétifiot, MMarchand, CBoyer, PLPommier, YHughes, SHBurke, TR 4-amino-1-hydroxy-2-oxo-1,8-naphthyridine-containing compounds having high potency against raltegravir-resistant integrase mutants of HIV-1. J Med Chem 57:5190-202 (2014)  
Target
Name:
Integrase
Synonyms:
Human immunodeficiency virus type 1 integrase
Type:
PROTEIN
Mol. Mass.:
32231.48
Organism:
Human immunodeficiency virus 1
Description:
ChEMBL_90865
Residue:
288
  
Inhibitor
Name:
BDBM50020259
Synonyms:
CHEMBL3288817
Type:
Small organic molecule
Emp. Form.:
C22H16F2N4O3
Mol. Mass.:
422.3842
SMILES:
On1c2ncccc2c(Nc2ccccc2)c(C(=O)NCc2ccc(F)cc2F)c1=O
: