Target
Integrase
Ligand
BDBM50020294
Substrate
Meas. Tech.
ChEMBL_1364989 (CHEMBL3295659)
IC50
8.4±n/a nM
Citation
 Zhao, XZSmith, SJMétifiot, MMarchand, CBoyer, PLPommier, YHughes, SHBurke, TR 4-amino-1-hydroxy-2-oxo-1,8-naphthyridine-containing compounds having high potency against raltegravir-resistant integrase mutants of HIV-1. J Med Chem 57:5190-202 (2014)  
Target
Name:
Integrase
Synonyms:
Human immunodeficiency virus type 1 integrase
Type:
PROTEIN
Mol. Mass.:
32231.48
Organism:
Human immunodeficiency virus 1
Description:
ChEMBL_90865
Residue:
288
  
Inhibitor
Name:
BDBM50020294
Synonyms:
CHEMBL3288834
Type:
Small organic molecule
Emp. Form.:
C20H18F2N4O6
Mol. Mass.:
448.3769
SMILES:
COC(=O)[C@H](CO)Nc1c(C(=O)NCc2ccc(F)cc2F)c(=O)n(O)c2ncccc12
: