Target
DNA polymerase alpha catalytic subunit
Ligand
BDBM50021053
Substrate
Meas. Tech.
ChEMBL_1365493 (CHEMBL3297008)
IC50
>100000±n/a nM
Citation
 Draffan, AGFrey, BPool, BGannon, CTyndall, EMLilly, MFrancom, PHufton, RHalim, RJahangiri, SBond, SNguyen, VTJeynes, TPWirth, VLuttick, ATilmanis, DThomas, JDPryor, MPorter, KMorton, CJLin, BDuan, JKukolj, GSimoneau, BMcKercher, GLagacé, LAmad, MBethell, RCTucker, SP Discovery and Synthesis of C-Nucleosides as Potential New Anti-HCV Agents. ACS Med Chem Lett 5:679-84 (2014)  
Target
Name:
DNA polymerase alpha catalytic subunit
Synonyms:
DNA polymerase (alpha/delta/epsilon) DPOLA_HUMAN POLA1
Type:
PROTEIN
Mol. Mass.:
165895.25
Organism:
Homo sapiens (Human)
Description:
ChEMBL_1365493
Residue:
1462
  
Inhibitor
Name:
BDBM50021053
Synonyms:
CHEMBL3287609
Type:
Small organic molecule
Emp. Form.:
C12H19N4O13P3
Mol. Mass.:
520.2195
SMILES:
C[C@@]1(O)[C@H](O)[C@@H](COP(O)(=O)OP(O)(=O)OP(O)(O)=O)O[C@H]1c1ccc2c(N)ncnn12
: