Target
DNA polymerase subunit gamma-1
Ligand
BDBM50021053
Substrate
Meas. Tech.
ChEMBL_1365495 (CHEMBL3297010)
IC50
>100000±n/a nM
Citation
 Draffan, AGFrey, BPool, BGannon, CTyndall, EMLilly, MFrancom, PHufton, RHalim, RJahangiri, SBond, SNguyen, VTJeynes, TPWirth, VLuttick, ATilmanis, DThomas, JDPryor, MPorter, KMorton, CJLin, BDuan, JKukolj, GSimoneau, BMcKercher, GLagacé, LAmad, MBethell, RCTucker, SP Discovery and Synthesis of C-Nucleosides as Potential New Anti-HCV Agents. ACS Med Chem Lett 5:679-84 (2014)  
Target
Name:
DNA polymerase subunit gamma-1
Synonyms:
DNA Polymerase gamma DNA polymerase (alpha/delta/epsilon) DNA polymerase delta subunit 1 DNA polymerase gamma subunit 1 DNA polymerase kappa DNA polymerase subunit gamma-1 DPOG1_HUMAN Mitochondrial DNA polymerase catalytic subunit POLG1 PolG-alpha
Type:
Enzyme Subunit
Mol. Mass.:
139566.98
Organism:
Homo sapiens (Human)
Description:
Enzyme was purchased from Ulrich Hubscher, University of Zurich-Irchel, Switzerland.
Residue:
1239
  
Inhibitor
Name:
BDBM50021053
Synonyms:
CHEMBL3287609
Type:
Small organic molecule
Emp. Form.:
C12H19N4O13P3
Mol. Mass.:
520.2195
SMILES:
C[C@@]1(O)[C@H](O)[C@@H](COP(O)(=O)OP(O)(=O)OP(O)(O)=O)O[C@H]1c1ccc2c(N)ncnn12
: