Target
25-hydroxyvitamin D-1 alpha hydroxylase, mitochondrial
Ligand
BDBM50023348
Substrate
Meas. Tech.
ChEMBL_1459634 (CHEMBL3369891)
IC50
160±n/a nM
Citation
 Ferla, SAboraia, ASBrancale, APepper, CJZhu, JOchalek, JTDeLuca, HFSimons, C Small-molecule inhibitors of 25-hydroxyvitamin D-24-hydroxylase (CYP24A1): synthesis and biological evaluation. J Med Chem 57:7702-15 (2014)  
Target
Name:
25-hydroxyvitamin D-1 alpha hydroxylase, mitochondrial
Synonyms:
25-OHD-1 alpha-hydroxylase 25-hydroxyvitamin D-1 alpha hydroxylase, mitochondrial Calcidiol 1-monooxygenase Cyp27b Cyp40 Cytochrome P450C1 alpha Cytochrome p450 27B1 | VD3 1A hydroxylase
Type:
PROTEIN
Mol. Mass.:
56238.51
Organism:
Mus musculus
Description:
ChEMBL_109473
Residue:
507
  
Inhibitor
Name:
BDBM50023348
Synonyms:
CHEMBL3329769
Type:
Small organic molecule
Emp. Form.:
C28H27N3O3
Mol. Mass.:
453.5323
SMILES:
COc1cc(OC)cc(\C=C\c2ccc(cc2)C(=O)NCC(c2ccccc2)n2ccnc2)c1
: