Target
5-hydroxytryptamine receptor 4
Ligand
BDBM50023377
Substrate
Meas. Tech.
ChEMBL_1460447 (CHEMBL3367331)
Ki
0.050119±n/a nM
Citation
 Brudeli, BNavaratnarajah, MAndressen, KWManfra, OMoltzau, LRNilsen, NOLevy, FOKlaveness, J Discovery and pharmacological profile of new hydrophilic 5-HT(4) receptor antagonists. Bioorg Med Chem Lett 24:4598-602 (2014)  
Target
Name:
5-hydroxytryptamine receptor 4
Synonyms:
5-HT-4 5-HT4S 5-HT4b 5-HT4d 5-hydroxytryptamine receptor 4 5HT4R_HUMAN Serotonin (5-HT) receptor Serotonin 4 (5-HT4) receptor | Serotonin Receptor 4
Type:
Enzyme
Mol. Mass.:
43767.54
Organism:
Homo sapiens (Human)
Description:
Q13639
Residue:
388
  
Inhibitor
Name:
BDBM50023377
Synonyms:
CHEMBL3329805
Type:
Small organic molecule
Emp. Form.:
C29H38N4O4S
Mol. Mass.:
538.701
SMILES:
CC(C)CS(=O)(=O)Nc1ccc(CN2CCC(CNC(=O)c3c4OCCCn4c4ccccc34)CC2)cc1
: