Target
Nitric oxide synthase, brain
Ligand
BDBM50023383
Substrate
Meas. Tech.
ChEMBL_1446355 (CHEMBL3374894)
Ki
13±n/a nM
Citation
 Jing, QLi, HRoman, LJMartásek, PPoulos, TLSilverman, RB Combination of chiral linkers with thiophenecarboximidamide heads to improve the selectivity of inhibitors of neuronal nitric oxide synthase. Bioorg Med Chem Lett 24:4504-10 (2014)  
Target
Name:
Nitric oxide synthase, brain
Synonyms:
Bnos NC-NOS NOS type I nNOS Neuronal nitric oxide synthase Nitric Oxide Synthase, brain Nitric oxide synthase, brain (nNOS) Nitric-oxide synthase, brain (nNOS) Nos1 | Peptidyl-cysteine S-nitrosylase NOS1
Type:
Enzyme
Mol. Mass.:
160570.98
Organism:
Rattus norvegicus (rat)
Description:
Recombinant nNOS overexpressed in E. coli was used in enzyme assays.
Residue:
1429
  
Inhibitor
Name:
BDBM50023383
Synonyms:
CHEMBL3325611
Type:
Small organic molecule
Emp. Form.:
C29H31N5O2S2
Mol. Mass.:
545.719
SMILES:
N=C(Nc1cccc(COC[C@@H]2C[C@H](CN2)OCc2cccc(NC(=N)c3cccs3)c2)c1)c1cccs1
: