Target
Aldo-keto reductase family 1 member C4
Ligand
BDBM50024764
Substrate
Meas. Tech.
ChEMBL_1438120 (CHEMBL3388495)
IC50
20000±n/a nM
Citation
 Endo, SHu, DMatsunaga, TOtsuji, YEl-Kabbani, OKandeel, MIkari, AHara, AKitade, YToyooka, N Synthesis of non-prenyl analogues of baccharin as selective and potent inhibitors for aldo-keto reductase 1C3. Bioorg Med Chem 22:5220-33 (2014)  
Target
Name:
Aldo-keto reductase family 1 member C4
Synonyms:
3-alpha-HSD1 3-alpha-hydroxysteroid dehydrogenase type I AKR1C4 Aldo-keto reductase family 1 member C4 (AK1C4) CHDR DD-4 Dihydrodiol dehydrogenase 4 | HAKRA
Type:
Enzyme
Mol. Mass.:
37068.40
Organism:
Homo sapiens (Human)
Description:
P17516
Residue:
323
  
Inhibitor
Name:
BDBM50024764
Synonyms:
CHEMBL3337721
Type:
Small organic molecule
Emp. Form.:
C25H22O6
Mol. Mass.:
418.4386
SMILES:
OC(=O)\C=C\c1ccc(OC(=O)CCc2ccccc2)c(OCc2cccc(O)c2)c1
: