Target
Acetylcholinesterase
Ligand
BDBM50027339
Substrate
Meas. Tech.
ChEMBL_1439748 (CHEMBL3385584)
IC50
110±n/a nM
Citation
 Ying, YMShan, WGZhan, ZJ Biotransformation of huperzine A by a fungal endophyte of Huperzia serrata furnished sesquiterpenoid-alkaloid hybrids. J Nat Prod 77:2054-9 (2014)  
Target
Name:
Acetylcholinesterase
Synonyms:
ACES_HUMAN Acetylcholinesterase (AChE) | Acetylcholinesterase (human AChE)
Type:
Enzyme
Mol. Mass.:
67792.70
Organism:
Homo sapiens (Human)
Description:
P22303
Residue:
614
  
Inhibitor
Name:
BDBM50027339
Synonyms:
CHEMBL3338388
Type:
Small organic molecule
Emp. Form.:
C30H40N2O4
Mol. Mass.:
492.6496
SMILES:
[H][C@@]12CC(C)(C)CC1=C1COC(N[C@@]34CC(C)=C[C@@]([H])(Cc5[nH]c(=O)ccc35)\C4=C/C)C1(O)C[C@@H](O)[C@@H]2C
: