Target
25-hydroxyvitamin D-1 alpha hydroxylase, mitochondrial
Ligand
BDBM50027699
Substrate
Meas. Tech.
ChEMBL_1435384 (CHEMBL3383458)
IC50
280±n/a nM
Citation
 Ferla, SGomaa, MSBrancale, AZhu, JOchalek, JTDeLuca, HFSimons, C Novel styryl-indoles as small molecule inhibitors of 25-hydroxyvitamin D-24-hydroxylase (CYP24A1): Synthesis and biological evaluation. Eur J Med Chem 87:39-51 (2014)  
Target
Name:
25-hydroxyvitamin D-1 alpha hydroxylase, mitochondrial
Synonyms:
25-OHD-1 alpha-hydroxylase 25-hydroxyvitamin D-1 alpha hydroxylase, mitochondrial Calcidiol 1-monooxygenase Cyp27b Cyp40 Cytochrome P450C1 alpha Cytochrome p450 27B1 | VD3 1A hydroxylase
Type:
PROTEIN
Mol. Mass.:
56238.51
Organism:
Mus musculus
Description:
ChEMBL_109473
Residue:
507
  
Inhibitor
Name:
BDBM50027699
Synonyms:
CHEMBL3344396
Type:
Small organic molecule
Emp. Form.:
C22H21N3
Mol. Mass.:
327.4222
SMILES:
C(Cn1ccnc1)Cn1ccc2cc(\C=C\c3ccccc3)ccc12
: