Target
25-hydroxyvitamin D-1 alpha hydroxylase, mitochondrial
Ligand
BDBM31768
Substrate
Meas. Tech.
ChEMBL_1435384 (CHEMBL3383458)
Ki
58±n/a nM
Citation
 Ferla, SGomaa, MSBrancale, AZhu, JOchalek, JTDeLuca, HFSimons, C Novel styryl-indoles as small molecule inhibitors of 25-hydroxyvitamin D-24-hydroxylase (CYP24A1): Synthesis and biological evaluation. Eur J Med Chem 87:39-51 (2014)  
Target
Name:
25-hydroxyvitamin D-1 alpha hydroxylase, mitochondrial
Synonyms:
25-OHD-1 alpha-hydroxylase 25-hydroxyvitamin D-1 alpha hydroxylase, mitochondrial Calcidiol 1-monooxygenase Cyp27b Cyp40 Cytochrome P450C1 alpha Cytochrome p450 27B1 | VD3 1A hydroxylase
Type:
PROTEIN
Mol. Mass.:
56238.51
Organism:
Mus musculus
Description:
ChEMBL_109473
Residue:
507
  
Inhibitor
Name:
BDBM31768
Synonyms:
CHEMBL295698 Nizoral | Panfungol
Type:
Small organic molecule
Emp. Form.:
C26H28Cl2N4O4
Mol. Mass.:
531.431
SMILES:
CC(=O)N1CCN(CC1)c1ccc(OC[C@@H]2CO[C@](Cn3ccnc3)(O2)c2ccc(Cl)cc2Cl)cc1
: