Target
Histone acetyltransferase KAT2A
Ligand
BDBM50028142
Substrate
Meas. Tech.
ChEMBL_1434756 (CHEMBL3383425)
IC50
<316±n/a nM
Citation
 Gosmini, RNguyen, VLToum, JSimon, CBrusq, JMKrysa, GMirguet, ORiou-Eymard, AMBoursier, EVTrottet, LBamborough, PClark, HChung, CWCutler, LDemont, EHKaur, RLewis, AJSchilling, MBSoden, PETaylor, SWalker, ALWalker, MDPrinjha, RKNicodème, E The discovery of I-BET726 (GSK1324726A), a potent tetrahydroquinoline ApoA1 up-regulator and selective BET bromodomain inhibitor. J Med Chem 57:8111-31 (2014)  
Target
Name:
Histone acetyltransferase KAT2A
Synonyms:
GCN5 GCN5L2 HGCN5 Histone acetyltransferase KAT2A HsGCN5 KAT2A_HUMAN STAF97
Type:
PROTEIN
Mol. Mass.:
93956.22
Organism:
Homo sapiens (Human)
Description:
ChEMBL_100876
Residue:
837
  
Inhibitor
Name:
BDBM50028142
Synonyms:
CHEMBL2177300
Type:
Small organic molecule
Emp. Form.:
C25H23ClN2O3
Mol. Mass.:
434.915
SMILES:
C[C@H]1C[C@@H](Nc2ccc(Cl)cc2)c2cc(ccc2N1C(C)=O)-c1ccc(cc1)C(O)=O
: