Target
Bromodomain and WD repeat-containing protein 1
Ligand
BDBM50028142
Substrate
Meas. Tech.
ChEMBL_1434767 (CHEMBL3383436)
IC50
31623±n/a nM
Citation
 Gosmini, RNguyen, VLToum, JSimon, CBrusq, JMKrysa, GMirguet, ORiou-Eymard, AMBoursier, EVTrottet, LBamborough, PClark, HChung, CWCutler, LDemont, EHKaur, RLewis, AJSchilling, MBSoden, PETaylor, SWalker, ALWalker, MDPrinjha, RKNicodème, E The discovery of I-BET726 (GSK1324726A), a potent tetrahydroquinoline ApoA1 up-regulator and selective BET bromodomain inhibitor. J Med Chem 57:8111-31 (2014)  
Target
Name:
Bromodomain and WD repeat-containing protein 1
Synonyms:
BRWD1 Bromodomain and WD repeat-containing protein 1 C21orf107 WDR9
Type:
PROTEIN
Mol. Mass.:
262994.15
Organism:
Homo sapiens (Human)
Description:
ChEMBL_109516
Residue:
2320
  
Inhibitor
Name:
BDBM50028142
Synonyms:
CHEMBL2177300
Type:
Small organic molecule
Emp. Form.:
C25H23ClN2O3
Mol. Mass.:
434.915
SMILES:
C[C@H]1C[C@@H](Nc2ccc(Cl)cc2)c2cc(ccc2N1C(C)=O)-c1ccc(cc1)C(O)=O
: