Target
cAMP-specific 3',5'-cyclic phosphodiesterase 7B
Ligand
BDBM50028887
Substrate
Meas. Tech.
ChEMBL_1432322 (CHEMBL3383866)
IC50
13900±n/a nM
Citation
 García, AMBrea, JMorales-García, JAPerez, DIGonzález, AAlonso-Gil, SGracia-Rubio, IRos-Simó, CConde, SCadavid, MILoza, MIPerez-Castillo, AValverde, OMartinez, AGil, C Modulation of cAMP-specific PDE without emetogenic activity: new sulfide-like PDE7 inhibitors. J Med Chem 57:8590-607 (2014)  
Target
Name:
cAMP-specific 3',5'-cyclic phosphodiesterase 7B
Synonyms:
3',5'-cyclic phosphodiesterase PDE7B_HUMAN Phosphodiesterase 7B (PDE7B) | cAMP-specific 3',5'-cyclic phosphodiesterase 7B
Type:
Enzyme
Mol. Mass.:
51842.76
Organism:
Homo sapiens (Human)
Description:
Q9NP56
Residue:
450
  
Inhibitor
Name:
BDBM50028887
Synonyms:
CHEMBL3359635
Type:
Small organic molecule
Emp. Form.:
C11H7ClN2O2S
Mol. Mass.:
266.703
SMILES:
[O-][N+](=O)c1cc(Cl)ccc1Sc1ccncc1
: