Target
Isocitrate dehydrogenase [NADP] cytoplasmic
Ligand
BDBM50029471
Substrate
Meas. Tech.
ChEMBL_1436945 (CHEMBL3388443)
Ki
2200±n/a nM
Citation
 Liu, ZYao, YKogiso, MZheng, BDeng, LQiu, JJDong, SLv, HGallo, JMLi, XNSong, Y Inhibition of cancer-associated mutant isocitrate dehydrogenases: synthesis, structure-activity relationship, and selective antitumor activity. J Med Chem 57:8307-18 (2014)  
Target
Name:
Isocitrate dehydrogenase [NADP] cytoplasmic
Synonyms:
Cytosolic NADP-isocitrate dehydrogenase IDH1 IDP Isocitrate dehydrogenase 1 (IDH1) Oxalosuccinate decarboxylase | PICD
Type:
Protein
Mol. Mass.:
46661.29
Organism:
Homo sapiens (Human)
Description:
O75874
Residue:
414
  
Inhibitor
Name:
BDBM50029471
Synonyms:
CHEMBL3343448
Type:
Small organic molecule
Emp. Form.:
C13H8F5NO2
Mol. Mass.:
305.2001
SMILES:
Cc1cc(Cc2c(F)c(F)c(F)c(F)c2F)n(O)c(=O)c1
: