Target
3-hydroxy-3-methylglutaryl-coenzyme A reductase
Ligand
BDBM50139181
Substrate
Meas. Tech.
ChEMBL_1437082 (CHEMBL3390813)
IC50
40±n/a nM
Citation
 Mendieta, AJiménez, FGarduño-Siciliano, LMojica-Villegas, ARosales-Acosta, BVilla-Tanaca, LChamorro-Cevallos, GMedina-Franco, JLMeurice, NGutiérrez, RUMontiel, LECruz, Mdel CTamariz, J Synthesis and highly potent hypolipidemic activity of alpha-asarone- and fibrate-based 2-acyl and 2-alkyl phenols as HMG-CoA reductase inhibitors. Bioorg Med Chem 22:5871-82 (2014)  
Target
Name:
3-hydroxy-3-methylglutaryl-coenzyme A reductase
Synonyms:
3-hydroxy-3-methylglutaryl-coenzyme A (HMG-CoA) reductase HMDH_HUMAN HMG-CoA reductase (HMGR) | HMGCR
Type:
Enzyme
Mol. Mass.:
97477.10
Organism:
Homo sapiens (Human)
Description:
P04035
Residue:
888
  
Inhibitor
Name:
BDBM50139181
Synonyms:
(1S,3R,7S,8S,8aR)-8-{2-[(2R,4R)-4-hydroxy-6-oxotetrahydro-2H-pyran-2-yl]ethyl}-3,7-dimethyl-1,2,3,7,8,8a-hexahydronaphthalen-1-yl 2,2-dimethylbutanoate MK-733 Simvastatin cid_54454
Type:
Small organic molecule
Emp. Form.:
C25H38O5
Mol. Mass.:
418.5662
SMILES:
CCC(C)(C)C(=O)O[C@H]1C[C@@H](C)C=C2C=C[C@H](C)[C@H](CC[C@@H]3C[C@@H](O)CC(=O)O3)[C@@H]12
: